{"text_format":"1","workbook":"xlsx","n_sheets":3,"sheets":["Sheet1","Sheet3","Sheet2"],"not_rendered":{"charts":0,"images":0,"macros":1,"external_links":0,"defined_names":1,"comments":0,"pivot_tables":0},"unopened":[],"bounds":{"document_bytes":16777216,"sheet_cells":100000,"rows_first":2000,"rows_last":500,"rows_between":2000,"halvings":0,"cell_chars":16384,"cell_head_chars":4096},"cells_cut":0,"cells_raw":0,"read":"whole","date_system":"1900"}

{"sheet":"Sheet1","index":0,"n_rows":26,"n_cols":14,"rows_kept":26,"cut":false,"hidden":false,"merged":[[25,1,25,3],[20,7,21,9],[20,1,20,6],[21,1,21,6],[18,1,18,6],[17,1,17,6],[17,7,18,9],[7,1,7,6],[6,1,6,6],[13,1,13,6],[14,1,14,6],[15,1,15,6],[12,1,12,2],[12,7,14,9]]}
["初めに選択→",null,null,null,null,null,null,null,"選択ｾﾙ",null,"記入ｾﾙ"]
[]
["　前払金請求書と併せて、この様式をメール送信又は郵送してください。"]
["　（請求書１枚につき、本様式も１枚必要です。）"]
["　発注機関担当者が、電子保証証書を閲覧、印刷のうえ、支払い手続きを行います。"]
[]
["発注者名",null,null,null,null,null,null,"←次に発注機関を選択"]
["送付先メールアドレス",{"$f":"VLOOKUP(B7,Sheet3!A3:D14,2,FALSE)","v":{"$error":"#N/A"}}]
["郵送先　　郵便番号",{"$f":"VLOOKUP(B7,Sheet3!A3:F14,5,FALSE)","v":{"$error":"#N/A"}},null,null,null,null,null,null,"ﾌｧｲﾙ名用\n発注機関",null,null,null,null,"全ての入力を確認後、ＰＤＦに変換のうえ、"]
["住 　　　 所",{"$f":"VLOOKUP(B7,Sheet3!A3:F14,6,FALSE)","v":{"$error":"#N/A"}},null,null,null,null,null,null,{"$f":"VLOOKUP(B7,Sheet3!A3:C14,3,FALSE)","v":{"$error":"#N/A"}},null,null,null,null,"各発注機関へ、請求書ともに提出してください。"]
["宛　　  　先",{"$f":"IF($B$7=\"建設部建築局計画管理課\",$B$7&\"契約係\",VLOOKUP($B$7,Sheet3!$A$3:$D$14,1,)&\"入札契約課\")","v":{"$error":"#N/A"}}]
[]
[{"$f":"IF(B1=\"工事\",\"工事番号\",\"業務番号\")","v":"業務番号"},null,null,null,null,null,null,"　　必ず記入\n　　してください",null,null,null,null,null,"なお、上記ボタンをクリックすると、"]
[{"$f":"IF(B1=\"工事\",\"工事名\",\"業務名\")","v":"業務名"},null,null,null,null,null,null,null,null,null,null,null,null,"このエクセルシートが保存されている場所と"]
[{"$f":"IF(B1=\"工事\",\"受注者名\",\"受託者名\")","v":"受託者名"},null,null,null,null,null,null,null,null,null,null,null,null,"同じ場所に「発注機関名＋工事（業務）番号＋受注（受託）者名」"]
["契約年月日",null,null,null,null,null,null,null,"←西暦／月／日で入力",null,null,null,null,"をファイル名としたこの様式がＰＤＦで保存されます。"]
[]
["保証契約番号",null,null,null,null,null,null,"　　必ず記入\n　　してください"]
["認証キー（暗証番号）"]
[]
["本件担当者名",null,null,null,null,null,null,"　　必ず記入\n　　してください"]
["連絡先"]
[]
["　なお、メールで提出される場合は、その旨、下記電話番号へ連絡をお願いいたします。"]
["　　連 絡 先 ：",{"$f":"IF($B$7=\"建設部建築局計画管理課\",$B$7&\"契約係\",VLOOKUP($B$7,Sheet3!$A$3:$D$14,1,)&\"入札契約課\")","v":{"$error":"#N/A"}}]
["　　電話番号：",{"$f":"VLOOKUP(B7,Sheet3!A3:D14,4,FALSE)","v":{"$error":"#N/A"}}]

{"sheet":"Sheet3","index":1,"n_rows":14,"n_cols":6,"rows_kept":14,"cut":false,"hidden":true,"merged":[]}
[]
["発注機関","メールアドレス","短縮","電話番号","郵便番号","住所"]
["建設部建築局計画管理課","kensetsu.kenkei1@pref.hokkaido.lg.jp","計画管理課","011-204-5592","060-8588","札幌市中央区北３条西６丁目　道庁９階"]
[]
["札幌建設管理部","satsudoboku.koji1@pref.hokkaido.lg.jp","札幌建管","011-561-0426","064-0811","札幌市中央区南11条西16丁目２番１号"]
["小樽建設管理部","otarukenkan.nyuusatu@pref.hokkaido.lg.jp","小樽建管","0134-25-2160","047-8369","小樽市奥沢１丁目21番１号"]
["室蘭建設管理部","murorandoboku.koji1@pref.hokkaido.lg.jp","室蘭建管","0143-24-9859","051-8558","室蘭市海岸町１丁目４番１号　むろらん広域センタービル"]
["函館建設管理部","hakodatekenkan.nyukeiseikyu@pref.hokkaido.lg.jp","函館建管","0138-47-9613","041-8558","函館市美原４丁目６番16号"]
["旭川建設管理部","asahikawadoboku.koji1@pref.hokkaido.lg.jp","旭川建管","0166-46-4912","079-8613","旭川市永山６条19丁目１番１号"]
["留萌建設管理部","rumoikenkan.nyukei@pref.hokkaido.lg.jp","留萌建管","0164-42-8347","077-8585","留萌市住之江町２丁目１－２"]
["稚内建設管理部","wakanaidoboku.koji1@pref.hokkaido.lg.jp","稚内建管","0162-33-2551","097-8558","稚内市末広４丁目２番27号"]
["網走建設管理部","abashiridoboku.koji1@pref.hokkaido.lg.jp","網走建管","0152-41-0710","093-8670","網走市北７条西３丁目　オホーツク合同庁舎"]
["帯広建設管理部","obihirodoboku.koji1@pref.hokkaido.lg.jp","帯広建管","0155-27-8710","080-8588","帯広市東３条南３丁目１番地"]
["釧路建設管理部","kushirodoboku.koji1@pref.hokkaido.lg.jp","釧路建管","0154-23-9120","085-0006","釧路市双葉町６番10号"]

{"sheet":"Sheet2","index":2,"n_rows":3,"n_cols":3,"rows_kept":3,"cut":false,"hidden":true,"merged":[]}
[]
["工事",null,"電子メール"]
["委託",null,"郵送"]