{"text_format":"1","workbook":"xlsx","n_sheets":5,"sheets":["別紙１（単体）","←単体で入札参加。どちらかに入力→","別紙１－②（代理人用) ","変更契約から紙契約希望→","別紙２（変更契約）"],"not_rendered":{"charts":0,"images":0,"macros":1,"external_links":0,"defined_names":4,"comments":3,"pivot_tables":0},"unopened":[],"bounds":{"document_bytes":16777216,"sheet_cells":100000,"rows_first":2000,"rows_last":500,"rows_between":2000,"halvings":0,"cell_chars":16384,"cell_head_chars":4096},"cells_cut":0,"cells_raw":0,"read":"whole","date_system":"1900"}

{"sheet":"別紙１（単体）","index":0,"n_rows":40,"n_cols":46,"rows_kept":40,"cut":false,"hidden":false,"merged":[[3,35,3,37],[4,35,4,37],[13,26,14,27],[13,28,14,32],[3,0,3,24],[4,27,5,28],[7,27,8,28],[10,27,11,28],[13,1,13,6],[13,7,13,24],[11,7,11,12],[10,7,10,12],[9,7,9,12],[9,13,9,23],[10,13,10,23],[11,13,11,17],[29,0,33,1],[32,5,32,8],[30,2,32,4],[31,9,31,13],[31,15,31,23],[32,19,32,21],[32,14,32,17],[32,9,32,12],[31,5,31,8],[30,5,30,8],[11,19,11,23],[33,38,34,44],[28,38,29,43],[23,5,24,6],[26,5,27,6],[30,9,30,23],[23,7,24,11],[23,13,24,23],[23,12,24,12],[23,26,27,32],[20,25,21,34],[23,2,24,4],[26,2,27,4],[26,7,27,11],[26,13,27,23],[26,12,27,12],[20,1,21,3],[16,1,16,3],[17,1,17,3],[16,6,16,8],[17,6,17,23]]}
[null,null,null,null,null,null,null,null,null,null,null,null,null,null,null,null,null,null,null,null,null,null,null,null,null,null,null,null,null,null,null,null,null,null,null,null,null,null,null,null,null,null,"発注機関名","支出負担行為担当者名"]
[null,null,null,null,null,null,null,null,null,null,null,null,null,null,null,null,null,null,null,null,null,null,null,null,null,null,null,null,null,null,null,null,null,null,null,null,null,null,null,null,null,10,"札幌建管","空知総合振興局長","satsudoboku.koji1@pref.hokkaido.lg.jp","011-561-0426"]
[null,null,null,null,null,null,null,null,null,null,null,null,null,null,null,null,null,null,null,null,null,null,null,null,null,null,null,null,null,null,null,null,null,null,null,null,null,null,null,null,null,11,"小樽建管","後志総合振興局長","otarukenkan.nyuusatu@pref.hokkaido.lg.jp","0134-25-2160"]
["契約に関する申出書",null,null,null,null,null,null,null,null,null,null,null,null,null,null,null,null,null,null,null,null,null,null,null,null,"はじめに選択↓",null,null,null,"契約区分",null,null,null,null,null,"入力箇所",null,null,null,null,null,12,"函館建管","渡島総合振興局長","hakodatekenkan.nyukeiseikyu@pref.hokkaido.lg.jp","0138-47-9613"]
[null,null,null,null,null,null,null,null,null,null,null,null,null,null,null,null,null,null,null,null,null,null,null,null,null,null,null,2,null,null,1,"工事",null,null,null,"選択箇所",null,null,null,null,null,13,"室蘭建管","胆振総合振興局長","murorandoboku.koji1@pref.hokkaido.lg.jp","0143-24-9859"]
[null,null,null,null,null,null,null,null,null,null,null,null,null,null,null,null,null,{"$f":"IF($AB$5=\"\",\"\",\"令和\")","v":"令和"},null,"年",null,"月",null,"日",null,null,null,null,null,null,2,"委託業務",null,null,null,null,null,null,null,null,null,14,"旭川建管","上川総合振興局長","asahikawadoboku.koji1@pref.hokkaido.lg.jp","0166-46-4912"]
[null,null,null,null,null,null,null,null,null,null,null,null,null,null,null,null,null,null,null,null,null,null,null,null,null,"次に選択↓",null,null,null,"発注機関",null,null,null,null,null,null,null,null,null,null,null,15,"留萌建管","留萌振興局長","rumoikenkan.nyukei@pref.hokkaido.lg.jp","0164-42-8347"]
[null,{"$f":"IF(AB8=\"\",\"（支出負担行為担当者）\",VLOOKUP(AB8,$AP$2:$AR$15,3,1))&\"　様\"","v":"（支出負担行為担当者）　様"},null,null,null,null,null,null,null,null,null,null,null,null,null,null,null,null,null,null,null,null,null,null,null,null,null,null,null,null,null,null,null,null,null,null,null,null,null,null,null,16,"稚内建管","宗谷総合振興局長","wakanaidoboku.koji1@pref.hokkaido.lg.jp","0162-33-2551"]
[null,null,null,null,null,null,null,null,null,null,null,null,null,null,null,null,null,null,null,null,null,null,null,null,null,null,null,null,null,null,null,null,null,null,null,null,null,null,null,null,null,17,"網走建管","オホーツク総合振興局長","abashiridoboku.koji1@pref.hokkaido.lg.jp","0152-41-0710"]
[null,null,null,null,null,null,null,"住所",null,null,null,null,null,null,null,null,null,null,null,null,null,null,null,null,null,null,null,null,null,"参加形態",null,null,null,null,null,null,null,null,null,null,null,18,"帯広建管","十勝総合振興局長","obihirodoboku.koji1@pref.hokkaido.lg.jp","0155-27-8710"]
[null,null,null,null,null,null,null,"商号又は名称",null,null,null,null,null,null,null,null,null,null,null,null,null,null,null,null,null,null,null,1,null,null,1,"単体",null,null,null,null,null,null,null,null,null,19,"釧路建管","釧路総合振興局長","kushirodoboku.koji1@pref.hokkaido.lg.jp","0154-23-9121"]
[null,null,null,null,null,null,null,"代表者役職・氏名",null,null,null,null,null,null,null,null,null,null,null,null,null,null,null,null,null,null,null,null,null,null,null,null,null,null,null,null,null,null,null,null,null,20,"建築局","北海道知事","kensetsu.kenkei1@pref.hokkaido.lg.jp","011-204-5592"]
[null,null,null,null,null,null,null,null,null,null,null,null,null,null,null,null,null,null,null,null,null,null,null,null,null,"最後に入力↓",null,null,null,null,null,null,null,null,null,null,null,null,null,null,null,21,"建築局（その他）","北海道教育委員会教育長","kensetsu.kenkei1@pref.hokkaido.lg.jp","011-204-5592"]
[null,{"$f":"AC14","v":"00:00:00"},null,null,null,null,null,{"$f":"\"に開札予定の次の\"&IF(AB5=1,AF5,AF6)&\"について、落札者となった\"","v":"に開札予定の次の委託業務について、落札者となった"},null,null,null,null,null,null,null,null,null,null,null,null,null,null,null,null,null,null,"開札日",null,null,null,null,null,null,null,null,null,null,null,null,null,null,22,"建築局（その他）","北海道病院事業管理者","kensetsu.kenkei1@pref.hokkaido.lg.jp","011-204-5592"]
["場合の契約方法を、次のとおり申し出ます。",null,null,null,null,null,null,null,null,null,null,null,null,null,null,null,null,null,null,null,null,null,null,null,null,null,null,null,null,null,null,null,null,null,null,null,null,null,null,null,null,23,"建築局（その他）","北海道警察本部長","kensetsu.kenkei1@pref.hokkaido.lg.jp","011-204-5592"]
[]
["（","整理番号",null,null,"）","（",null,null,null,"）"]
[null,{"$f":"IF(AB5=1,\"工事名\",\"業務名\")","v":"業務名"},null,null,null,null,null,null,null,null,null,null,null,null,null,null,null,null,null,null,null,null,null,null,null,"←案件名"]
[null,null,null,null,null,null,null,null,null,null,null,null,null,null,null,null,null,null,null,null,null,null,null,null,null,null,null,null,null,null,null,null,null,null,null,null,null,null,"＜ファイル名用＞"]
[null,null,null,null,null,null,null,null,null,null,null,null,null,null,null,null,null,null,null,null,null,null,null,null,null,null,null,null,null,null,null,null,null,null,null,null,null,null,null,null,null,"発注機関",{"$f":"VLOOKUP(AR20,AP2:AQ12,2,1)","v":{"$error":"#N/A"}},{"$f":"AB8","v":0}]
[null,"契約方法\n等の申出",null,null,null,null,null,"紙での契約を希望します。",null,null,null,null,null,null,null,null,null,null,null,null,null,null,null,null,null,"←どちらかにチェックしてください",null,null,null,null,null,null,null,null,null,null,null,null,null,null,null,"開札日",{"$f":"MONTH(AC14)&\"月\"&DAY(AC14)&\"日\"","v":"1月0日"}]
[null,null,null,null,null,null,null,"電子契約を希望します。",null,null,null,null,null,null,null,null,null,null,null,null,null,null,null,null,null,null,null,null,null,null,null,null,null,null,null,null,null,null,null,null,null,"整理番号",{"$f":"G17","v":0}]
[null,null,null,null,null,null,null,"なお、契約書送付先のメールアドレスは、次のとおりです。",null,null,null,null,null,null,null,null,null,null,null,null,null,null,null,null,null,null,null,null,null,null,null,null,null,null,null,null,null,null,null,null,null,"入札参加者名",{"$f":"N11","v":0}]
[null,null,"(締結権限者)",null,null,"氏名",null,null,null,null,null,null,"ｱﾄﾞ\nﾚｽ",null,null,null,null,null,null,null,null,null,null,null,null,null,"・発注者から事務担当→締結権限者の順に署名依頼のメールが届きます。\n・締結権限者のみの記載でも契約締結は可能です。",null,null,null,null,null,null,null,null,null,null,null,null,null,null,"タイトル","契約に関する申出書"]
[]
[]
[null,null,"(契約担当者)",null,null,"氏名",null,null,null,null,null,null,"ｱﾄﾞ\nﾚｽ"]
[null,null,null,null,null,null,null,null,null,null,null,null,null,null,null,null,null,null,null,null,null,null,null,null,null,null,null,null,null,null,null,null,null,null,null,null,null,null,"全ての入力内容を確認後、ＰＤＦに変換のうえ、"]
[null,null,null,null,null,null,null,null,null,null,null,null,null,null,null,null,null,null,null,null,null,null,null,null,null,null,null,null,null,null,null,null,null,null,null,null,null,null,"電子入札システムにて、入札金額等の送信時に、"]
["連絡先"]
{"$rows_left_out":11}
{"sheet":"←単体で入札参加。どちらかに入力→","index":1,"n_rows":19,"n_cols":9,"rows_kept":19,"cut":false,"hidden":false,"merged":[[3,8,3,15],[12,0,12,7]]}
[]
["別紙１（単体）　又は",null,null,null,null,null,null,null,"←ＩＣカードの名義が「代表者」の場合"]
[]
["別紙１－②（代理人用）のどちらかに",null,null,null,null,null,null,null,"←ＩＣカードの名義が代表者から委任された代理人の場合\n（年間委任状や当該案件に係る委任状の提出が必要）"]
[]
["必要事項を入力後、PDFで保存の上、",null,null,null,null,null,null,null,"※両方に入力すると別紙２に不具合が生じますので、どちらか一方にのみ入力してください"]
[]
["入札金額送信の際、内訳書と同時に"]
[]
["提出してください。"]
[]
[]
["＜電子入札案件に「紙参加」する場合＞"]
["　事前に必要事項を記入の上、開札日に持参し、落札者と"]
["なった場合に、契約担当課へ提出してください。"]
["　なお、総合評価落札方式及び事後審査型入札の場合は、"]
["入札書等と同時に提出してください。"]
["　また、郵送の場合は、入札書、内訳書とともに同封して"]
["ください。"]

{"sheet":"別紙１－②（代理人用) ","index":2,"n_rows":42,"n_cols":46,"rows_kept":42,"cut":false,"hidden":false,"merged":[[31,0,35,1],[32,2,34,4],[32,5,32,8],[32,9,32,23],[33,5,33,8],[33,9,33,13],[33,15,33,23],[34,5,34,8],[34,9,34,12],[34,14,34,17],[34,19,34,21],[28,5,29,6],[28,13,29,23],[29,38,30,43],[18,1,18,3],[18,6,18,8],[19,1,19,3],[19,6,19,23],[22,1,23,3],[25,2,26,4],[25,7,26,11],[25,5,26,6],[28,12,29,12],[25,12,26,12],[25,13,26,23],[28,2,29,4],[28,7,29,11],[13,19,13,23],[12,13,12,23],[13,26,14,27],[15,1,15,6],[15,7,15,24],[36,38,37,43],[25,26,29,32],[22,25,23,33],[31,38,32,43],[13,28,14,32],[3,0,3,24],[3,35,3,37],[4,27,5,28],[4,35,4,37],[7,27,8,28],[9,7,9,12],[9,13,9,23],[10,27,11,28],[10,7,10,12],[10,13,10,23],[11,7,11,12],[11,13,11,17],[11,19,11,23]]}
[null,null,null,null,null,null,null,null,null,null,null,null,null,null,null,null,null,null,null,null,null,null,null,null,null,null,null,null,null,null,null,null,null,null,null,null,null,null,null,null,null,null,"発注機関名","支出負担行為担当者名"]
[null,null,null,null,null,null,null,null,null,null,null,null,null,null,null,null,null,null,null,null,null,null,null,null,null,null,null,null,null,null,null,null,null,null,null,null,null,null,null,null,null,10,"札幌建管","空知総合振興局長","satsudoboku.koji1@pref.hokkaido.lg.jp","011-561-0426"]
[null,null,null,null,null,null,null,null,null,null,null,null,null,null,null,null,null,null,null,null,null,null,null,null,null,null,null,null,null,null,null,null,null,null,null,null,null,null,null,null,null,11,"小樽建管","後志総合振興局長","otarukenkan.nyuusatu@pref.hokkaido.lg.jp","0134-25-2160"]
["契約に関する申出書",null,null,null,null,null,null,null,null,null,null,null,null,null,null,null,null,null,null,null,null,null,null,null,null,"はじめに選択↓",null,null,null,"契約区分",null,null,null,null,null,"入力箇所",null,null,null,null,null,12,"函館建管","渡島総合振興局長","hakodatekenkan.nyukeiseikyu@pref.hokkaido.lg.jp","0138-47-9613"]
[null,null,null,null,null,null,null,null,null,null,null,null,null,null,null,null,null,null,null,null,null,null,null,null,null,null,null,null,null,null,1,"工事",null,null,null,"選択箇所",null,null,null,null,null,13,"室蘭建管","胆振総合振興局長","murorandoboku.koji1@pref.hokkaido.lg.jp","0143-24-9859"]
[null,null,null,null,null,null,null,null,null,null,null,null,null,null,null,null,null,{"$f":"IF($AB$5=\"\",\"\",\"令和\")","v":""},null,"年",null,"月",null,"日",null,null,null,null,null,null,2,"委託業務",null,null,null,null,null,null,null,null,null,14,"旭川建管","上川総合振興局長","asahikawadoboku.koji1@pref.hokkaido.lg.jp","0166-46-4912"]
[null,null,null,null,null,null,null,null,null,null,null,null,null,null,null,null,null,null,null,null,null,null,null,null,null,"次に選択↓",null,null,null,"発注機関",null,null,null,null,null,null,null,null,null,null,null,15,"留萌建管","留萌振興局長","rumoikenkan.nyukei@pref.hokkaido.lg.jp","0164-42-8347"]
[null,{"$f":"IF(AB8=\"\",\"（支出負担行為担当者）\",VLOOKUP(AB8,$AP$2:$AR$15,3,1))&\"　様\"","v":"（支出負担行為担当者）　様"},null,null,null,null,null,null,null,null,null,null,null,null,null,null,null,null,null,null,null,null,null,null,null,null,null,null,null,null,null,null,null,null,null,null,null,null,null,null,null,16,"稚内建管","宗谷総合振興局長","wakanaidoboku.koji1@pref.hokkaido.lg.jp","0162-33-2551"]
[null,null,null,null,null,null,null,null,null,null,null,null,null,null,null,null,null,null,null,null,null,null,null,null,null,null,null,null,null,null,null,null,null,null,null,null,null,null,null,null,null,17,"網走建管","オホーツク総合振興局長","abashiridoboku.koji1@pref.hokkaido.lg.jp","0152-41-0710"]
[null,null,null,null,null,null,null,"住所",null,null,null,null,null,null,null,null,null,null,null,null,null,null,null,null,null,null,null,null,null,"参加形態",null,null,null,null,null,null,null,null,null,null,null,18,"帯広建管","十勝総合振興局長","obihirodoboku.koji1@pref.hokkaido.lg.jp","0155-27-8710"]
[null,null,null,null,null,null,null,"商号又は名称",null,null,null,null,null,null,null,null,null,null,null,null,null,null,null,null,null,null,null,1,null,null,1,"単体",null,null,null,null,null,null,null,null,null,19,"釧路建管","釧路総合振興局長","kushirodoboku.koji1@pref.hokkaido.lg.jp","0154-23-9121"]
[null,null,null,null,null,null,null,"代表者役職・氏名",null,null,null,null,null,null,null,null,null,null,null,null,null,null,null,null,null,null,null,null,null,null,null,null,null,null,null,null,null,null,null,null,null,20,"建築局","北海道知事","kensetsu.kenkei1@pref.hokkaido.lg.jp","011-204-5592"]
[null,null,null,null,null,null,"代理人","住所",null,null,null,null,null,null,null,null,null,null,null,null,null,null,null,null,null,"最後に入力↓",null,null,null,null,null,null,null,null,null,null,null,null,null,null,null,21,"建築局（その他）","北海道教育委員会教育長","kensetsu.kenkei1@pref.hokkaido.lg.jp","011-204-5592"]
[null,null,null,null,null,null,null,"氏名",null,null,null,null,null,null,null,null,null,null,null,null,null,null,null,null,null,null,"開札日",null,null,null,null,null,null,null,null,null,null,null,null,null,null,22,"建築局（その他）","北海道病院事業管理者","kensetsu.kenkei1@pref.hokkaido.lg.jp","011-204-5592"]
[null,null,null,null,null,null,null,null,null,null,null,null,null,null,null,null,null,null,null,null,null,null,null,null,null,null,null,null,null,null,null,null,null,null,null,null,null,null,null,null,null,23,"建築局（その他）","北海道警察本部長","kensetsu.kenkei1@pref.hokkaido.lg.jp","011-204-5592"]
[null,{"$f":"AC14","v":"00:00:00"},null,null,null,null,null,{"$f":"\"に開札予定の次の\"&IF(AB5=1,AF5,AF6)&\"について、落札者となった\"","v":"に開札予定の次の委託業務について、落札者となった"}]
["場合の契約方法を、次のとおり申し出ます。"]
[]
["（","整理番号",null,null,"）","（",null,null,null,"）",null,null,null,null,null,null,null,null,null,null,null,null,null,null,null,null,null,null,null,null,null,null,null,null,null,null,null,null,"＜ファイル名用＞"]
[null,{"$f":"IF(AB5=1,\"工事名\",\"業務名\")","v":"業務名"},null,null,null,null,null,null,null,null,null,null,null,null,null,null,null,null,null,null,null,null,null,null,null,"←案件名",null,null,null,null,null,null,null,null,null,null,null,null,null,null,null,"発注機関",{"$f":"VLOOKUP(AR20,AP2:AQ12,2,1)","v":{"$error":"#N/A"}},{"$f":"AB8","v":0}]
[null,null,null,null,null,null,null,null,null,null,null,null,null,null,null,null,null,null,null,null,null,null,null,null,null,null,null,null,null,null,null,null,null,null,null,null,null,null,null,null,null,"開札日",{"$f":"MONTH(AC14)&\"月\"&DAY(AC14)&\"日\"","v":"1月0日"}]
[null,null,null,null,null,null,null,null,null,null,null,null,null,null,null,null,null,null,null,null,null,null,null,null,null,null,null,null,null,null,null,null,null,null,null,null,null,null,null,null,null,"整理番号",{"$f":"G19","v":0}]
[null,"契約方法\n等の申出",null,null,null,null,null,"紙での契約を希望します。",null,null,null,null,null,null,null,null,null,null,null,null,null,null,null,null,null,"←どちらかにチェックしてください",null,null,null,null,null,null,null,null,null,null,null,null,null,null,null,"入札参加者名",{"$f":"N11","v":0}]
[null,null,null,null,null,null,null,"電子契約を希望します。",null,null,null,null,null,null,null,null,null,null,null,null,null,null,null,null,null,null,null,null,null,null,null,null,null,null,null,null,null,null,null,null,null,"タイトル","契約に関する申出書"]
[null,null,null,null,null,null,null,"なお、契約書送付先のメールアドレスは、次のとおりです。"]
[null,null,"(締結権限者)",null,null,"氏名",null,null,null,null,null,null,"ｱﾄﾞ\nﾚｽ",null,null,null,null,null,null,null,null,null,null,null,null,null,"・発注者から事務担当→締結権限者の順に署名依頼のメールが届きます。\n・締結権限者のみの記載でも契約締結は可能です。"]
[]
[]
[null,null,"(契約担当者)",null,null,"氏名",null,null,null,null,null,null,"ｱﾄﾞ\nﾚｽ"]
[null,null,null,null,null,null,null,null,null,null,null,null,null,null,null,null,null,null,null,null,null,null,null,null,null,null,null,null,null,null,null,null,null,null,null,null,null,null,"全ての入力内容を確認後、ＰＤＦに変換のうえ、"]
{"$rows_left_out":13}
{"sheet":"変更契約から紙契約希望→","index":3,"n_rows":14,"n_cols":1,"rows_kept":14,"cut":false,"hidden":false,"merged":[]}
[]
["変更契約から「紙契約」を希望する"]
[]
["場合、別紙２（変更契約）を、直接"]
[]
["契約担当課へ提出してください。"]
[]
["なお、メールで提出される場合は、"]
[]
["行き違い等の防止のため、お手数"]
[]
["ですが、その旨、電話連絡をお願い"]
[]
["いたします。"]

{"sheet":"別紙２（変更契約）","index":4,"n_rows":29,"n_cols":44,"rows_kept":29,"cut":false,"hidden":false,"merged":[[28,8,28,23],[19,14,19,17],[19,19,19,21],[16,0,20,1],[17,2,19,4],[17,5,17,8],[17,9,17,23],[18,5,18,8],[18,9,18,13],[18,15,18,23],[19,5,19,8],[19,9,19,12],[26,7,26,23],[27,7,27,23],[10,26,11,27],[10,28,11,32],[10,1,10,6],[10,7,10,24],[13,1,13,3],[13,6,13,8],[15,38,16,44],[20,38,21,47],[0,0,0,24],[8,7,8,12],[8,13,8,17],[8,19,8,23],[0,35,0,37],[1,27,2,28],[1,35,1,37],[4,27,5,28],[6,7,6,12],[6,13,6,23],[7,7,7,12],[7,13,7,23],[14,1,14,3],[14,6,14,23]]}
["変更契約に関する申出書",null,null,null,null,null,null,null,null,null,null,null,null,null,null,null,null,null,null,null,null,null,null,null,null,null,null,null,null,"契約区分",null,null,null,null,null,"入力箇所"]
[null,null,null,null,null,null,null,null,null,null,null,null,null,null,null,null,null,null,null,null,null,null,null,null,null,null,null,{"$f":"IF('別紙１－②（代理人用) '!AB5:AC6=\"\",'別紙１（単体）'!AB5:AC6,'別紙１－②（代理人用) '!AB5:AC6)","v":{"$error":"#VALUE!"}},null,null,1,"工事",null,null,null,"選択箇所"]
[null,null,null,null,null,null,null,null,null,null,null,null,null,null,null,null,null,{"$f":"IF($AB$2=\"\",\"\",\"令和\")","v":{"$error":"#VALUE!"}},null,"年",null,"月",null,"日",null,null,null,null,null,null,2,"委託業務"]
[null,null,null,null,null,null,null,null,null,null,null,null,null,null,null,null,null,null,null,null,null,null,null,null,null,null,null,null,null,"発注機関"]
[null,{"$f":"'別紙１（単体）'!B8","v":"（支出負担行為担当者）　様"},null,null,null,null,null,null,null,null,null,null,null,null,null,null,null,null,null,null,null,null,null,null,null,null,null,{"$f":"IF('別紙１－②（代理人用) '!AB8:AC9=\"\",'別紙１（単体）'!AB8:AC9,'別紙１－②（代理人用) '!AB8:AC9)","v":{"$error":"#VALUE!"}}]
[null,null,null,null,null,null,null,null,null,null,null,null,null,null,null,null,null,null,null,null,null,null,null,null,null,null,null,null,null,null,null,null,null,null,null,null,null,null,null,"＜ファイル名用＞"]
[null,null,null,null,null,null,null,"住所",null,null,null,null,null,{"$f":"IF('別紙１－②（代理人用) '!N10:X10=\"\",'別紙１（単体）'!N10:X10,'別紙１－②（代理人用) '!N10:X10)","v":0},null,null,null,null,null,null,null,null,null,null,null,null,null,null,null,null,null,null,null,null,null,null,null,null,null,null,null,"発注機関",{"$f":"VLOOKUP(AR7,'別紙１（単体）'!AP2:AQ12,2,1)","v":{"$error":"#VALUE!"}},{"$f":"AB5","v":{"$error":"#VALUE!"}}]
[null,null,null,null,null,null,null,"商号又は名称",null,null,null,null,null,{"$f":"IF('別紙１－②（代理人用) '!N11:X11=\"\",'別紙１（単体）'!N11:X11,'別紙１－②（代理人用) '!N11:X11)","v":0},null,null,null,null,null,null,null,null,null,null,null,null,null,null,null,null,null,null,null,null,null,null,null,null,null,null,null,"当初契約日",{"$f":"MONTH(AC11)&\"月\"&DAY(AC11)&\"日\"","v":"1月0日"}]
[null,null,null,null,null,null,null,"代表者役職・氏名",null,null,null,null,null,{"$f":"IF('別紙１－②（代理人用) '!N12:R12=\"\",'別紙１（単体）'!N12:R12,'別紙１－②（代理人用) '!N12:R12)","v":0},null,null,null,null,null,{"$f":"IF('別紙１－②（代理人用) '!T12:X12=\"\",'別紙１（単体）'!T12:X12,'別紙１－②（代理人用) '!T12:X12)","v":0},null,null,null,null,null,null,null,null,null,null,null,null,null,null,null,null,null,null,null,null,null,{"$f":"B14","v":{"$error":"#VALUE!"}},{"$f":"G14","v":0}]
[null,null,null,null,null,null,null,null,null,null,null,null,null,null,null,null,null,null,null,null,null,null,null,null,null,"はじめに入力↓",null,null,null,null,null,null,null,null,null,null,null,null,null,null,null,{"$f":"IF(AB2=1,\"受注者\",\"受託者\")","v":{"$error":"#VALUE!"}},{"$f":"N8","v":0}]
[null,{"$f":"AC11","v":"00:00:00"},null,null,null,null,null,{"$f":"\"に契約締結した次の\"&IF(AB2=1,AF2,AF3)&\"について、\"&\"第\"&AE14&\"回変更契約から\"","v":{"$error":"#VALUE!"}},null,null,null,null,null,null,null,null,null,null,null,null,null,null,null,null,null,null,"当初\n契約日",null,null,null,null,null,null,null,null,null,null,null,null,null,null,"タイトル","変更契約に関する申出書"]
["紙での契約を希望するので、申し出ます。"]
[]
["（",{"$f":"IF(AB2=1,\"工事番号\",\"業務番号\")","v":{"$error":"#VALUE!"}},null,null,"）","（",{"$f":"IF('別紙１－②（代理人用) '!G19:I19=\"\",'別紙１（単体）'!G17:I17,'別紙１－②（代理人用) '!G19:I19)","v":0},null,null,"）",null,null,null,null,null,null,null,null,null,null,null,null,null,null,null,null,"設計変更回数",null,null,null,"１","←最後に入力"]
[null,{"$f":"IF(AB2=1,\"工事名\",\"業務名\")","v":{"$error":"#VALUE!"}},null,null,null,null,{"$f":"IF('別紙１－②（代理人用) '!G20:X20=\"\",'別紙１（単体）'!G18:X18,'別紙１－②（代理人用) '!G20:X20)","v":0}]
[null,null,null,null,null,null,null,null,null,null,null,null,null,null,null,null,null,null,null,null,null,null,null,null,null,null,null,null,null,null,null,null,null,null,null,null,null,null,"全ての入力内容を確認後、ＰＤＦに変換のうえ、"]
["連絡先"]
[null,null,"担当者",null,null,"（所属）",null,null,null,null,null,null,null,null,null,null,null,null,null,null,null,null,null,null,null,null,null,null,null,null,null,null,null,null,null,null,null,null,"入札契約課へ送付してください。"]
[null,null,null,null,null,"（職・氏名）",null,null,null,null,null,null,null,null,"・",null,null,null,null,null,null,null,null,null,null,"当初契約時と連絡先が違う場合も想定されるので",null,null,null,null,null,null,null,null,null,null,null,null,"なお、←のＰＤＦ化をクリックすると、"]
[null,null,null,null,null,"（電話番号）",null,null,null,null,null,null,null,"－",null,null,null,null,"－",null,null,null,null,null,null,"お手数ですが、ご入力ください",null,null,null,null,null,null,null,null,null,null,null,null,"このエクセルシートが保存されている場所と同じ場所に"]
[null,null,null,null,null,null,null,null,null,null,null,null,null,null,null,null,null,null,null,null,null,null,null,null,null,null,null,null,null,null,null,null,null,null,null,null,null,null,{"$f":"\"「発注機関名_当初契約日_\"&B14&\"_契約者名_変更契約に係る申出書」\"","v":{"$error":"#VALUE!"}}]
[]
[null,"（留意事項）",null,null,null,null,null,null,null,null,null,null,null,null,null,null,null,null,null,null,null,null,null,null,null,null,null,null,null,null,null,null,null,null,null,null,null,null,"をファイル名としたこの様式が、ＰＤＦで保存されます。"]
[null,null,"※",{"$f":"\"この申出書は、\"&IF(AB2=1,\"工事監督員\",\"業務担当員\")&\"に変更契約に係る設計変更上申日を確認した上で、\"","v":{"$error":"#VALUE!"}},null,null,null,null,null,null,null,null,null,null,null,null,null,null,null,null,null,null,null,null,null,null,null,null,null,null,null,null,null,null,null,null,null,null,"（ＰＤＦの保存範囲は、Ａ～Ｙ列までです。）"]
[null,null,null,"各発注機関へ直接、提出してください。"]
[]
[null,null,null,"提 出 先",null,null,null,{"$f":"IF(AB5=20,\"建設部建築局計画管理課管理調整係\",VLOOKUP(AB5,'別紙１（単体）'!$AP$2:$AT$12,2,1)&\"入札契約課予算係\")","v":{"$error":"#VALUE!"}}]
[null,null,null,"電　　話",null,null,null,{"$f":"VLOOKUP(AB5,'別紙１（単体）'!$AP$2:$AT$12,5,1)","v":{"$error":"#VALUE!"}}]
[null,null,null,"メールアドレス",null,null,null,null,{"$f":"VLOOKUP(AB5,'別紙１（単体）'!$AP$2:$AT$12,4,1)","v":{"$error":"#VALUE!"}}]